Reaction Details
TargetTGF-beta receptor type-1
LigandBDBM50151357
Substrate/Competitorn/a
Meas. Tech.ChEMBL_305842 (CHEMBL829583)
IC50 50±n/a nM
Citation Gellibert, FWoolven, JFouchet, MHMathews, NGoodland, HLovegrove, VLaroze, ANguyen, VLSautet, SWang, RJanson, CSmith, WKrysa, GBoullay, VDe Gouville, ACHuet, SHartley, D Identification of 1,5-naphthyridine derivatives as a novel series of potent and selective TGF-beta type I receptor inhibitors. J Med Chem47:4494-506 (2004) 
 
TGF-beta receptor type-1
Name:TGF-beta receptor type-1
Type:enzyme
Mol. Mass.:55968.24
Organism:Homo sapiens (Human)
Description:P36897
Residue:503
BDBM50151357
NameBDBM50151357
Synonyms:2-(3-(pyridin-2-yl)-1H-pyrazol-4-yl)-1,5-naphthyridine CHEMBL183354
TypeSmall organic molecule
Emp. Form.C16H11N5
Mol. Mass.273.292
SMILESc1[nH]nc(c1-c1ccc2ncccc2n1)-c1ccccn1