Reaction Details
TargetTGF-beta receptor type-1
LigandBDBM50151353
Substrate/Competitorn/a
Meas. Tech.ChEMBL_306807 (CHEMBL832529)
IC50 40±n/a nM
Citation Gellibert, FWoolven, JFouchet, MHMathews, NGoodland, HLovegrove, VLaroze, ANguyen, VLSautet, SWang, RJanson, CSmith, WKrysa, GBoullay, VDe Gouville, ACHuet, SHartley, D Identification of 1,5-naphthyridine derivatives as a novel series of potent and selective TGF-beta type I receptor inhibitors. J Med Chem47:4494-506 (2004) 
 
TGF-beta receptor type-1
Name:TGF-beta receptor type-1
Type:enzyme
Mol. Mass.:55968.24
Organism:Homo sapiens (Human)
Description:P36897
Residue:503
BDBM50151353
NameBDBM50151353
Synonyms:4-(4-Fluoro-phenyl)-5-[1,5]naphthyridin-2-yl-thiazol-2-ylamine CHEMBL361237
TypeSmall organic molecule
Emp. Form.C17H11FN4S
Mol. Mass.322.359
SMILESNc1nc(c(s1)-c1ccc2ncccc2n1)-c1ccc(F)cc1