Reaction Details
TargetTGF-beta receptor type-1
LigandBDBM50151361
Substrate/Competitorn/a
Meas. Tech.ChEMBL_306825 (CHEMBL831016)
IC50 10960±n/a nM
Citation Gellibert, FWoolven, JFouchet, MHMathews, NGoodland, HLovegrove, VLaroze, ANguyen, VLSautet, SWang, RJanson, CSmith, WKrysa, GBoullay, VDe Gouville, ACHuet, SHartley, D Identification of 1,5-naphthyridine derivatives as a novel series of potent and selective TGF-beta type I receptor inhibitors. J Med Chem47:4494-506 (2004) 
 
TGF-beta receptor type-1
Name:TGF-beta receptor type-1
Type:enzyme
Mol. Mass.:55968.24
Organism:Homo sapiens (Human)
Description:P36897
Residue:503
BDBM50151361
NameBDBM50151361
Synonyms:5-(naphthalen-1-yl)-4-(pyridin-2-yl)thiazol-2-amine CHEMBL365918
TypeSmall organic molecule
Emp. Form.C18H13N3S
Mol. Mass.303.381
SMILESNc1nc(c(s1)-c1cccc2ccccc12)-c1ccccn1