Reaction Details
TargetMitogen-activated protein kinase kinase kinase 11
LigandBDBM50151347
Substrate/Competitorn/a
Meas. Tech.ChEMBL_306263 (CHEMBL828396)
IC50>16000±n/a nM
Citation Gellibert, FWoolven, JFouchet, MHMathews, NGoodland, HLovegrove, VLaroze, ANguyen, VLSautet, SWang, RJanson, CSmith, WKrysa, GBoullay, VDe Gouville, ACHuet, SHartley, D Identification of 1,5-naphthyridine derivatives as a novel series of potent and selective TGF-beta type I receptor inhibitors. J Med Chem47:4494-506 (2004) 
 
Mitogen-activated protein kinase kinase kinase 11
Name:Mitogen-activated protein kinase kinase kinase 11
Type:PROTEIN
Mol. Mass.:92696.93
Organism:Homo sapiens (Human)
Description:ChEMBL_1460565
Residue:847
BDBM50151347
NameBDBM50151347
Synonyms:2-(3-(6-methylpyridin-2-yl)-1H-pyrazol-4-yl)-1,5-naphthyridine CHEMBL185238
TypeSmall organic molecule
Emp. Form.C17H13N5
Mol. Mass.287.3186
SMILESCc1cccc(n1)-c1n[nH]cc1-c1ccc2ncccc2n1