Reaction Details
TargetTGF-beta receptor type-1
LigandBDBM50151365
Substrate/Competitorn/a
Meas. Tech.ChEMBL_306620 (CHEMBL829080)
IC50>10000±n/a nM
Citation Gellibert, FWoolven, JFouchet, MHMathews, NGoodland, HLovegrove, VLaroze, ANguyen, VLSautet, SWang, RJanson, CSmith, WKrysa, GBoullay, VDe Gouville, ACHuet, SHartley, D Identification of 1,5-naphthyridine derivatives as a novel series of potent and selective TGF-beta type I receptor inhibitors. J Med Chem47:4494-506 (2004) 
 
TGF-beta receptor type-1
Name:TGF-beta receptor type-1
Type:enzyme
Mol. Mass.:55968.24
Organism:Homo sapiens (Human)
Description:P36897
Residue:503
BDBM50151365
NameBDBM50151365
Synonyms:5-(6-Ethoxy-[1,5]naphthyridin-2-yl)-4-pyridin-2-yl-thiazol-2-ylamine | CHEMBL360613
TypeSmall organic molecule
Emp. Form.C18H15N5OS
Mol. Mass.349.41
SMILESCCOc1ccc2nc(ccc2n1)-c1sc(N)nc1-c1ccccn1