Reaction Details
TargetTGF-beta receptor type-1
LigandBDBM50151359
Substrate/Competitorn/a
Meas. Tech.ChEMBL_305842 (CHEMBL829583)
IC50>10000±n/a nM
Citation Gellibert, FWoolven, JFouchet, MHMathews, NGoodland, HLovegrove, VLaroze, ANguyen, VLSautet, SWang, RJanson, CSmith, WKrysa, GBoullay, VDe Gouville, ACHuet, SHartley, D Identification of 1,5-naphthyridine derivatives as a novel series of potent and selective TGF-beta type I receptor inhibitors. J Med Chem47:4494-506 (2004) 
 
TGF-beta receptor type-1
Name:TGF-beta receptor type-1
Type:enzyme
Mol. Mass.:55968.24
Organism:Homo sapiens (Human)
Description:P36897
Residue:503
BDBM50151359
NameBDBM50151359
Synonyms:4-(5-Methyl-pyridin-2-yl)-5-quinolin-4-yl-thiazol-2-ylamine | CHEMBL359611
TypeSmall organic molecule
Emp. Form.C18H14N4S
Mol. Mass.318.396
SMILESCc1ccc(nc1)-c1nc(N)sc1-c1ccnc2ccccc12