Reaction Details
TargetTGF-beta receptor type-1
LigandBDBM50151360
Substrate/Competitorn/a
Meas. Tech.ChEMBL_306620 (CHEMBL829080)
IC50>10000±n/a nM
Citation Gellibert, FWoolven, JFouchet, MHMathews, NGoodland, HLovegrove, VLaroze, ANguyen, VLSautet, SWang, RJanson, CSmith, WKrysa, GBoullay, VDe Gouville, ACHuet, SHartley, D Identification of 1,5-naphthyridine derivatives as a novel series of potent and selective TGF-beta type I receptor inhibitors. J Med Chem47:4494-506 (2004) 
 
TGF-beta receptor type-1
Name:TGF-beta receptor type-1
Type:enzyme
Mol. Mass.:55968.24
Organism:Homo sapiens (Human)
Description:P36897
Residue:503
BDBM50151360
NameBDBM50151360
Synonyms:4-(2-Methoxy-phenyl)-5-quinolin-4-yl-thiazol-2-ylamine | CHEMBL185237
TypeSmall organic molecule
Emp. Form.C19H15N3OS
Mol. Mass.333.407
SMILESCOc1ccccc1-c1nc(N)sc1-c1ccnc2ccccc12