Reaction Details
TargetMelanocortin receptor 3
LigandBDBM50151502
Substrate/Competitorn/a
Meas. Tech.ChEMBL_302996 (CHEMBL830235)
Ki 15000±n/a nM
Citation Mutulis, FYahorava, SMutule, IYahorau, ALiepinsh, EKopantshuk, SVeiksina, STars, KBelyakov, SMishnev, ARinken, AWikberg, JE New substituted piperazines as ligands for melanocortin receptors. Correlation to the X-ray structure of"THIQ". J Med Chem47:4613-26 (2004) 
 
Melanocortin receptor 3
Name:Melanocortin receptor 3
Type:Enzyme
Mol. Mass.:36044.86
Organism:Homo sapiens (Human)
Description:P41968
Residue:323
BDBM50151502
NameBDBM50151502
Synonyms:1,2,3,4-Tetrahydro-isoquinoline-3-carboxylic acid [(R)-1-(4-chloro-benzyl)-2-oxo-2-(4-phenyl-piperazin-1-yl)-ethyl]-amide | CHEMBL185195
TypeSmall organic molecule
Emp. Form.C29H31ClN4O2
Mol. Mass.503.035
SMILESClc1ccc(C[C@@H](NC(=O)C2Cc3ccccc3CN2)C(=O)N2CCN(CC2)c2ccccc2)cc1