Reaction Details
TargetMelanocortin receptor 5
LigandBDBM50151503
Substrate/Competitorn/a
Meas. Tech.ChEMBL_302998 (CHEMBL830237)
Ki 94000±n/a nM
Citation Mutulis, FYahorava, SMutule, IYahorau, ALiepinsh, EKopantshuk, SVeiksina, STars, KBelyakov, SMishnev, ARinken, AWikberg, JE New substituted piperazines as ligands for melanocortin receptors. Correlation to the X-ray structure of"THIQ". J Med Chem47:4613-26 (2004) 
 
Melanocortin receptor 5
Name:Melanocortin receptor 5
Type:Enzyme
Mol. Mass.:36612.92
Organism:Homo sapiens (Human)
Description:P33032
Residue:325
BDBM50151503
NameBDBM50151503
Synonyms:1,2,3,4-Tetrahydro-isoquinoline-3-carboxylic acid [(R)-1-(4-chloro-benzyl)-2-oxo-2-(4-oxy-4-phenyl-piperazin-1-yl)-ethyl]-amide | CHEMBL362010
TypeSmall organic molecule
Emp. Form.C29H31ClN4O3
Mol. Mass.519.034
SMILES[O-][N+]1(CCN(CC1)C(=O)[C@@H](Cc1ccc(Cl)cc1)NC(=O)C1Cc2ccccc2CN1)c1ccccc1