Reaction Details
TargetMelanocyte-stimulating hormone receptor
LigandBDBM50151507
Substrate/Competitorn/a
Meas. Tech.ChEMBL_302995 (CHEMBL830234)
Ki 2000±n/a nM
Citation Mutulis, FYahorava, SMutule, IYahorau, ALiepinsh, EKopantshuk, SVeiksina, STars, KBelyakov, SMishnev, ARinken, AWikberg, JE New substituted piperazines as ligands for melanocortin receptors. Correlation to the X-ray structure of"THIQ". J Med Chem47:4613-26 (2004) 
 
Melanocyte-stimulating hormone receptor
Name:Melanocyte-stimulating hormone receptor
Type:Enzyme
Mol. Mass.:34717.23
Organism:Homo sapiens (Human)
Description:Q01726
Residue:317
BDBM50151507
NameBDBM50151507
Synonyms:1,2,3,4-Tetrahydro-isoquinoline-3-carboxylic acid {(R)-1-(4-chloro-benzyl)-2-oxo-2-[4-(2-[1,2,4]triazol-1-ylmethyl-cyclohexyl)-piperazin-1-yl]-ethyl}-amide | CHEMBL263182
TypeSmall organic molecule
Emp. Form.C32H40ClN7O2
Mol. Mass.590.159
SMILESClc1ccc(C[C@@H](NC(=O)C2Cc3ccccc3CN2)C(=O)N2CCN(CC2)C2CCCCC2Cn2cncn2)cc1