Reaction Details
TargetMelanocortin receptor 4
LigandBDBM50151509
Substrate/Competitorn/a
Meas. Tech.ChEMBL_302997 (CHEMBL830236)
Ki 860.0±n/a nM
Citation Mutulis, FYahorava, SMutule, IYahorau, ALiepinsh, EKopantshuk, SVeiksina, STars, KBelyakov, SMishnev, ARinken, AWikberg, JE New substituted piperazines as ligands for melanocortin receptors. Correlation to the X-ray structure of"THIQ". J Med Chem47:4613-26 (2004) 
 
Melanocortin receptor 4
Name:Melanocortin receptor 4
Type:Enzyme
Mol. Mass.:36949.50
Organism:Homo sapiens (Human)
Description:P32245
Residue:332
BDBM50151509
NameBDBM50151509
Synonyms:1,2,3,4-Tetrahydro-isoquinoline-3-carboxylic acid {(R)-1-(4-chloro-benzyl)-2-oxo-2-[4-((1S,2S)-2-[1,2,4]triazol-1-yl-cyclohexyl)-piperazin-1-yl]-ethyl}-amide | CHEMBL362670
TypeSmall organic molecule
Emp. Form.C31H38ClN7O2
Mol. Mass.576.132
SMILESClc1ccc(C[C@@H](NC(=O)C2Cc3ccccc3CN2)C(=O)N2CCN(CC2)[C@H]2CCCC[C@@H]2n2cncn2)cc1