Reaction Details
TargetMelanocortin receptor 5
LigandBDBM50151510
Substrate/Competitorn/a
Meas. Tech.ChEMBL_302998 (CHEMBL830237)
Ki 14000±n/a nM
Citation Mutulis, FYahorava, SMutule, IYahorau, ALiepinsh, EKopantshuk, SVeiksina, STars, KBelyakov, SMishnev, ARinken, AWikberg, JE New substituted piperazines as ligands for melanocortin receptors. Correlation to the X-ray structure of"THIQ". J Med Chem47:4613-26 (2004) 
 
Melanocortin receptor 5
Name:Melanocortin receptor 5
Type:Enzyme
Mol. Mass.:36612.92
Organism:Homo sapiens (Human)
Description:P33032
Residue:325
BDBM50151510
NameBDBM50151510
Synonyms:1,2,3,4-Tetrahydro-isoquinoline-3-carboxylic acid {(R)-1-(4-chloro-benzyl)-2-oxo-2-[4-(1-[1,2,4]triazol-1-ylmethyl-cyclohexyl)-piperazin-1-yl]-ethyl}-amide | CHEMBL405150
TypeSmall organic molecule
Emp. Form.C32H40ClN7O2
Mol. Mass.590.159
SMILESClc1ccc(C[C@@H](NC(=O)C2Cc3ccccc3CN2)C(=O)N2CCN(CC2)C2(Cn3cncn3)CCCCC2)cc1