Reaction Details
TargetMelanocyte-stimulating hormone receptor
LigandBDBM50151511
Substrate/Competitorn/a
Meas. Tech.ChEMBL_302995 (CHEMBL830234)
Ki 760±n/a nM
Citation Mutulis, FYahorava, SMutule, IYahorau, ALiepinsh, EKopantshuk, SVeiksina, STars, KBelyakov, SMishnev, ARinken, AWikberg, JE New substituted piperazines as ligands for melanocortin receptors. Correlation to the X-ray structure of"THIQ". J Med Chem47:4613-26 (2004) 
 
Melanocyte-stimulating hormone receptor
Name:Melanocyte-stimulating hormone receptor
Type:Enzyme
Mol. Mass.:34717.23
Organism:Homo sapiens (Human)
Description:Q01726
Residue:317
BDBM50151511
NameBDBM50151511
Synonyms:1,2,3,4-Tetrahydro-isoquinoline-3-carboxylic acid [(R)-1-(4-chloro-benzyl)-2-(4-cyclohexyl-4-[1,2,4]triazol-1-ylmethyl-piperidin-1-yl)-2-oxo-ethyl]-amide N-((R)-1-(4-((1H-1,2,4-triazol-1-yl)methyl)-4-cyclohexylpiperidin-1-yl)-3-(4-chlorophenyl)-1-oxopropan-2-yl)-1,2,3,4-tetrahydroisoquinoline-3-carboxamide
TypeSmall organic molecule
Emp. Form.C33H41ClN6O2
Mol. Mass.589.171
SMILESClc1ccc(C[C@@H](NC(=O)C2Cc3ccccc3CN2)C(=O)N2CCC(Cn3cncn3)(CC2)C2CCCCC2)cc1