Reaction Details
TargetMelanocyte-stimulating hormone receptor
LigandBDBM50151505
Substrate/Competitorn/a
Meas. Tech.ChEMBL_302995 (CHEMBL830234)
Ki 530±n/a nM
Citation Mutulis, FYahorava, SMutule, IYahorau, ALiepinsh, EKopantshuk, SVeiksina, STars, KBelyakov, SMishnev, ARinken, AWikberg, JE New substituted piperazines as ligands for melanocortin receptors. Correlation to the X-ray structure of"THIQ". J Med Chem47:4613-26 (2004) 
 
Melanocyte-stimulating hormone receptor
Name:Melanocyte-stimulating hormone receptor
Type:Enzyme
Mol. Mass.:34717.23
Organism:Homo sapiens (Human)
Description:Q01726
Residue:317
BDBM50151505
NameBDBM50151505
Synonyms:1,2,3,4-Tetrahydro-isoquinoline-3-carboxylic acid {(R)-1-(4-chloro-benzyl)-2-oxo-2-[4-(1-[1,2,4]triazol-1-ylmethyl-cyclopentyl)-piperazin-1-yl]-ethyl}-amide | CHEMBL180937
TypeSmall organic molecule
Emp. Form.C31H38ClN7O2
Mol. Mass.576.132
SMILESClc1ccc(C[C@@H](NC(=O)C2Cc3ccccc3CN2)C(=O)N2CCN(CC2)C2(Cn3cncn3)CCCC2)cc1