Reaction Details
TargetAlpha-1A adrenergic receptor
LigandBDBM30703
Substrate/Competitorn/a
Meas. Tech.ChEMBL_302582 (CHEMBL839542)
Ki 91±n/a nM
Citation Prisinzano, TDukat, MLaw, HSlassi, AMacLean, NDeLannoy, IGlennon, RA 2-(Anilino)imidazolines and 2-(benzyl)imidazoline derivatives as h5-HT1D serotonin receptor ligands. Bioorg Med Chem Lett14:4697-9 (2004) 
 
Alpha-1A adrenergic receptor
Name:Alpha-1A adrenergic receptor
Type:Cell-surface receptors
Mol. Mass.:51511.67
Organism:Homo sapiens (Human)
Description:P35348
Residue:466
BDBM30703
NameBDBM30703
Synonyms:2-(4-tert-butyl-2,6-dimethyl-benzyl)-2-imidazoline;hydrochloride 2-[(4-tert-butyl-2,6-dimethylphenyl)methyl]-4,5-dihydro-1H-imidazole;hydrochloride MLS000069695 XYLOMETAZOLINE HYDROCHLORIDE cid_5282386
TypeSmall organic molecule
Emp. Form.C16H24N2
Mol. Mass.244.3752
SMILESCc1cc(cc(C)c1CC1=NCCN1)C(C)(C)C