Reaction Details
TargetSensory histidine kinase DcuS
LigandBDBM50151879
Substrate/Competitorn/a
Meas. Tech.ChEMBL_305974 (CHEMBL832960)
IC50 6±n/a nM
Citation Chan, WCCoyle, BJWilliams, P Virulence regulation and quorum sensing in staphylococcal infections: competitive AgrC antagonists as quorum sensing inhibitors. J Med Chem47:4633-41 (2004) 
 
Sensory histidine kinase DcuS
Name:Sensory histidine kinase DcuS
Synonyms:Receptor-histidine kinase AgrC
Type:PROTEIN
Mol. Mass.:49890.25
Organism:Staphylococcus aureus
Description:ChEMBL_305973
Residue:430
BDBM50151879
NameBDBM50151879
TypeSmall organic molecule
Emp. Form.C38H60N8O11S
Mol. Mass.836.995
SMILESCC[C@H](C)[C@H](N)C(=O)N[C@@H](CC(N)=O)C(=O)N[C@@H](CS)C(=O)N[C@@H](CC(O)=O)C(=O)N[C@@H](Cc1ccccc1)C(=O)N[C@@H](CC(C)C)C(=O)N[C@@H](CC(C)C)C(O)=O