Reaction Details
TargetSensory histidine kinase DcuS
LigandBDBM50151882
Substrate/Competitorn/a
Meas. Tech.ChEMBL_304243 (CHEMBL841798)
EC50 11000±n/a nM
Citation Chan, WCCoyle, BJWilliams, P Virulence regulation and quorum sensing in staphylococcal infections: competitive AgrC antagonists as quorum sensing inhibitors. J Med Chem47:4633-41 (2004) 
 
Sensory histidine kinase DcuS
Name:Sensory histidine kinase DcuS
Synonyms:Receptor-histidine kinase AgrC
Type:PROTEIN
Mol. Mass.:49890.25
Organism:Staphylococcus aureus
Description:ChEMBL_305973
Residue:430
BDBM50151882
NameBDBM50151882
TypeSmall organic molecule
Emp. Form.C41H56N8O13S
Mol. Mass.900.994
SMILESCC[C@H](C)[C@@H]1NC(=O)[C@@H](Cc2ccccc2)NC(=O)[C@H](CC(O)=O)NC(=O)[C@H](CSC(=O)[C@@H](C)NC1=O)NC(=O)[C@@H](NC(=O)[C@H](CO)NC(=O)[C@@H](N)Cc1ccc(O)cc1)[C@@H](C)O