Reaction Details
TargetAlpha-2A/Alpha-2B/Alpha-2C adrenergic receptor
LigandBDBM50005127
Substrate/Competitorn/a
Meas. Tech.ChEMBL_305457 (CHEMBL830954)
IC50 1000±n/a nM
Citation Heinrich, TBöttcher, HBartoszyk, GDGreiner, HESeyfried, CAVan Amsterdam, C Indolebutylamines as selective 5-HT(1A) agonists. J Med Chem47:4677-83 (2004) 
 
Alpha-2A/Alpha-2B/Alpha-2C adrenergic receptor
Name:Alpha-2A/Alpha-2B/Alpha-2C adrenergic receptor
Type:n/a
Mol. Mass.:n/a
Description:ASSAY_ID of ChEMBL is 305672
Components:This complex has 3 components.
Component 1
Name:Alpha-2B adrenergic receptor
Synonyms:ADA2B_HUMAN ADRA2L1 Adrenergic alpha2B Adrenergic receptor alpha Alpha-2 adrenergic receptor subtype C2 Alpha-2B adrenoreceptor | Alpha-2BAR
Type:Enzyme
Mol. Mass.:49964.20
Organism:Homo sapiens (Human)
Description:P18089
Residue:450
Component 2
Name:Alpha-2A adrenergic receptor
Synonyms:ADA2A_HUMAN ADRA2R Adrenergic alpha2A Alpha-2 adrenergic receptor subtype C10 Alpha-2A adrenoreceptor alpha-2A adrenergic receptor [Homo sapiens]
Type:Enzyme
Mol. Mass.:48979.91
Organism:Homo sapiens (Human)
Description:P08913
Residue:465
Component 3
Name:Alpha-2C adrenergic receptor
Synonyms:ADA2C_HUMAN ADRA2L2 Adrenergic alpha2C Adrenergic receptor alpha Alpha-2 adrenergic receptor subtype C4 Alpha-2C adrenoreceptor | adrenergic, alpha-2C-, receptor [Homo sapiens]
Type:Enzyme
Mol. Mass.:49552.32
Organism:Homo sapiens (Human)
Description:P18825
Residue:462
BDBM50005127
NameBDBM50005127
Synonyms:1,1-Dioxo-2-[4-(4-pyrimidin-2-yl-piperazin-1-yl)-butyl]-1,2-dihydro-1lambda*6*-benzo[d]isothiazol-3-one 1,1-Dioxo-2-[4-(4-pyrimidin-2-yl-piperazin-1-yl)-butyl]-1,2-dihydro-1lambda*6*-benzo[d]isothiazol-3-one(Ipsapirone) IPSAPIRONE
TypeSmall organic molecule
Emp. Form.C19H23N5O3S
Mol. Mass.401.483
SMILESO=C1N(CCCCN2CCN(CC2)c2ncccn2)S(=O)(=O)c2ccccc12