Reaction Details
Target5-hydroxytryptamine receptor 1A
LigandBDBM50002173
Substrate/Competitorn/a
Meas. Tech.ChEBML_306314
IC50 0.800000±n/a nM
Citation Heinrich, TBöttcher, HBartoszyk, GDGreiner, HESeyfried, CAVan Amsterdam, C Indolebutylamines as selective 5-HT(1A) agonists. J Med Chem47:4677-83 (2004) 
 
5-hydroxytryptamine receptor 1A
Name:5-hydroxytryptamine receptor 1A
Type:G Protein-Coupled Receptor (GPCR)
Mol. Mass.:46445.29
Organism:Rattus norvegicus (rat)
Description:Binding assays were performed using rat hippocampal membranes.
Residue:422
BDBM50002173
NameBDBM50002173
Synonyms:3-(4-(3,6-dihydro-4-phenyl-1(2H)-pyridinyl)butyl)-1H-indol-5-ol 3-[4-(4-phenyl-3,6-dihydropyridin-1(2H)-yl)butyl]-1H-indol-5-ol roxindole
TypeSmall organic molecule
Emp. Form.C23H26N2O
Mol. Mass.346.4653
SMILESOc1ccc2[nH]cc(CCCCN3CCC(=CC3)c3ccccc3)c2c1