Reaction Details
TargetD(2) dopamine receptor
LigandBDBM50151950
Substrate/Competitorn/a
Meas. Tech.ChEBML_305865
IC50 97±n/a nM
Citation Heinrich, TBöttcher, HBartoszyk, GDGreiner, HESeyfried, CAVan Amsterdam, C Indolebutylamines as selective 5-HT(1A) agonists. J Med Chem47:4677-83 (2004) 
 
D(2) dopamine receptor
Name:D(2) dopamine receptor
Type:G Protein-Coupled Receptor (GPCR)
Mol. Mass.:50931.60
Organism:Rattus norvegicus (rat)
Description:P61169
Residue:444
BDBM50151950
NameBDBM50151950
Synonyms:3-{4-[4-(2-Carbamoyl-phenyl)-piperazin-1-yl]-butyl}-1H-indole-5-carboxylic acid amide | CHEMBL186608
TypeSmall organic molecule
Emp. Form.C24H29N5O2
Mol. Mass.419.5194
SMILESNC(=O)c1ccc2[nH]cc(CCCCN3CCN(CC3)c3ccccc3C(N)=O)c2c1