Reaction Details
Target5-hydroxytryptamine receptor 1A
LigandBDBM50151954
Substrate/Competitorn/a
Meas. Tech.ChEBML_306314
IC50 0.100000±n/a nM
Citation Heinrich, TBöttcher, HBartoszyk, GDGreiner, HESeyfried, CAVan Amsterdam, C Indolebutylamines as selective 5-HT(1A) agonists. J Med Chem47:4677-83 (2004) 
 
5-hydroxytryptamine receptor 1A
Name:5-hydroxytryptamine receptor 1A
Type:G Protein-Coupled Receptor (GPCR)
Mol. Mass.:46445.29
Organism:Rattus norvegicus (rat)
Description:Binding assays were performed using rat hippocampal membranes.
Residue:422
BDBM50151954
NameBDBM50151954
Synonyms:3-{4-[4-(4-Acetylamino-phenyl)-piperazin-1-yl]-butyl}-1H-indole-5-carboxylic acid amide | CHEMBL189708
TypeSmall organic molecule
Emp. Form.C25H31N5O2
Mol. Mass.433.5459
SMILESCC(=O)Nc1ccc(cc1)N1CCN(CCCCc2c[nH]c3ccc(cc23)C(N)=O)CC1