Reaction Details
Target5-hydroxytryptamine receptor 1A
LigandBDBM50151962
Substrate/Competitorn/a
Meas. Tech.ChEBML_306314
IC50 0.400000±n/a nM
Citation Heinrich, TBöttcher, HBartoszyk, GDGreiner, HESeyfried, CAVan Amsterdam, C Indolebutylamines as selective 5-HT(1A) agonists. J Med Chem47:4677-83 (2004) 
 
5-hydroxytryptamine receptor 1A
Name:5-hydroxytryptamine receptor 1A
Type:G Protein-Coupled Receptor (GPCR)
Mol. Mass.:46445.29
Organism:Rattus norvegicus (rat)
Description:Binding assays were performed using rat hippocampal membranes.
Residue:422
BDBM50151962
NameBDBM50151962
Synonyms:3-{4-[4-(2,3-Dihydro-benzofuran-5-yl)-piperazin-1-yl]-butyl}-5-methoxy-1H-indole | CHEMBL189454
TypeSmall organic molecule
Emp. Form.C25H31N3O2
Mol. Mass.405.5325
SMILESCOc1ccc2[nH]cc(CCCCN3CCN(CC3)c3ccc4OCCc4c3)c2c1