Reaction Details
TargetD(2) dopamine receptor
LigandBDBM50151933
Substrate/Competitorn/a
Meas. Tech.ChEBML_305865
IC50 6.2±n/a nM
Citation Heinrich, TBöttcher, HBartoszyk, GDGreiner, HESeyfried, CAVan Amsterdam, C Indolebutylamines as selective 5-HT(1A) agonists. J Med Chem47:4677-83 (2004) 
 
D(2) dopamine receptor
Name:D(2) dopamine receptor
Type:G Protein-Coupled Receptor (GPCR)
Mol. Mass.:50931.60
Organism:Rattus norvegicus (rat)
Description:P61169
Residue:444
BDBM50151933
NameBDBM50151933
Synonyms:3-{4-[4-(2-Cyano-phenyl)-piperazin-1-yl]-butyl}-1H-indole-5-carboxylic acid amide | CHEMBL189450
TypeSmall organic molecule
Emp. Form.C24H27N5O
Mol. Mass.401.5041
SMILESNC(=O)c1ccc2[nH]cc(CCCCN3CCN(CC3)c3ccccc3C#N)c2c1