Reaction Details
Target5-hydroxytryptamine receptor 1A
LigandBDBM50151984
Substrate/Competitorn/a
Meas. Tech.ChEBML_306315
IC50 1±n/a nM
Citation Heinrich, TBöttcher, HGericke, RBartoszyk, GDAnzali, SSeyfried, CAGreiner, HEVan Amsterdam, C Synthesis and structure--activity relationship in a class of indolebutylpiperazines as dual 5-HT(1A) receptor agonists and serotonin reuptake inhibitors. J Med Chem47:4684-92 (2004) 
 
5-hydroxytryptamine receptor 1A
Name:5-hydroxytryptamine receptor 1A
Type:G Protein-Coupled Receptor (GPCR)
Mol. Mass.:46445.29
Organism:Rattus norvegicus (rat)
Description:Binding assays were performed using rat hippocampal membranes.
Residue:422
BDBM50151984
NameBDBM50151984
Synonyms:3-{4-[4-(4-Methoxy-phenyl)-piperazin-1-yl]-butyl}-1H-indole-5-carbonitrile | CHEMBL189758
TypeSmall organic molecule
Emp. Form.C24H28N4O
Mol. Mass.388.5053
SMILESCOc1ccc(cc1)N1CCN(CCCCc2c[nH]c3ccc(cc23)C#N)CC1