Reaction Details
TargetSolute carrier family 15 member 1
LigandBDBM50152065
Substrate/Competitorn/a
Meas. Tech.ChEMBL_306163 (CHEMBL831529)
IC50 422000.0±n/a nM
Citation Våbenø, JNielsen, CUIngebrigtsen, TLejon, TSteffansen, BLuthman, K Dipeptidomimetic ketomethylene isosteres as pro-moieties for drug transport via the human intestinal di-/tripeptide transporter hPEPT1: design, synthesis, stability, and biological investigations. J Med Chem47:4755-65 (2004) 
 
Solute carrier family 15 member 1
Name:Solute carrier family 15 member 1
Type:PROTEIN
Mol. Mass.:78818.07
Organism:Homo sapiens (Human)
Description:ChEMBL_1488839
Residue:708
BDBM50152065
NameBDBM50152065
Synonyms:3-Amino-4-oxo-heptanedioic acid 1-benzyl ester | CHEMBL434541
TypeSmall organic molecule
Emp. Form.C14H17NO5
Mol. Mass.279.2885
SMILESNC(CC(=O)OCc1ccccc1)C(=O)CCC(O)=O