Reaction Details
TargetSolute carrier family 15 member 1
LigandBDBM50152062
Substrate/Competitorn/a
Meas. Tech.ChEMBL_303277 (CHEMBL876384)
Ki 68000±n/a nM
Citation Våbenø, JNielsen, CUIngebrigtsen, TLejon, TSteffansen, BLuthman, K Dipeptidomimetic ketomethylene isosteres as pro-moieties for drug transport via the human intestinal di-/tripeptide transporter hPEPT1: design, synthesis, stability, and biological investigations. J Med Chem47:4755-65 (2004) 
 
Solute carrier family 15 member 1
Name:Solute carrier family 15 member 1
Type:PROTEIN
Mol. Mass.:78818.07
Organism:Homo sapiens (Human)
Description:ChEMBL_1488839
Residue:708
BDBM50152062
NameBDBM50152062
Synonyms:2-(3-Amino-2-oxo-4-phenyl-butyl)-succinic acid 4-benzyl ester | CHEMBL189777
TypeSmall organic molecule
Emp. Form.C21H23NO5
Mol. Mass.369.411
SMILESN[C@@H](Cc1ccccc1)C(=O)C[C@@H](CC(=O)OCc1ccccc1)C(O)=O