Reaction Details
TargetLysosomal alpha-glucosidase
LigandBDBM18355
Substrate/Competitorn/a
Meas. Tech.ChEMBL_2157198 (CHEMBL5041858)
Ki 200±n/a nM
Citation Kato, ANakagome, IKanekiyo, ULu, TTLi, YXYoshimura, KKishida, MShinzawa, KYoshida, TTanaka, NJia, YMNash, RJFleet, GWJYu, CY 5- J Med Chem65:2329-2341 (2022) 
 
Lysosomal alpha-glucosidase
Name:Lysosomal alpha-glucosidase
Type:PROTEIN
Mol. Mass.:105312.45
Organism:Homo sapiens (Human)
Description:ChEMBL_1506060
Residue:952
BDBM18355
NameBDBM18355
Synonyms:(2R,3R,4R,5S)-1-butyl-2-(hydroxymethyl)piperidine-3,4,5-triol MIGLUSTAT US20230339856, Compound NB-DNJ | US9181184, 5
TypeSmall organic molecule
Emp. Form.C10H21NO4
Mol. Mass.219.278
SMILESCCCCN1C[C@H](O)[C@@H](O)[C@H](O)[C@H]1CO