Reaction Details
TargetMelanin-concentrating hormone receptor 1
LigandBDBM50152454
Substrate/Competitorn/a
Meas. Tech.ChEMBL_306737 (CHEMBL832324)
IC50 7.0±n/a nM
Citation Vasudevan, AWodka, DVerzal, MKSouers, AJGao, JBrodjian, SFry, DDayton, BMarsh, KCHernandez, LEOgiela, CACollins, CAKym, PR Synthesis and evaluation of 2-amino-8-alkoxy quinolines as MCHr1 antagonists. Part 2. Bioorg Med Chem Lett14:4879-82 (2004) 
 
Melanin-concentrating hormone receptor 1
Name:Melanin-concentrating hormone receptor 1
Type:G Protein-Coupled Receptor (GPCR)
Mol. Mass.:45976.27
Organism:Homo sapiens (Human)
Description:Membranes from CHO-K1 cells stably expressing human MCH1R were used in assays.
Residue:422
BDBM50152454
NameBDBM50152454
Synonyms:Benzo[1,3]dioxole-5-carboxylic acid [3-(2-amino-quinolin-8-yloxy)-propyl]-amide | CHEMBL184191
TypeSmall organic molecule
Emp. Form.C20H19N3O4
Mol. Mass.365.3826
SMILESNc1ccc2cccc(OCCCNC(=O)c3ccc4OCOc4c3)c2n1