Reaction Details
TargetMelanin-concentrating hormone receptor 1
LigandBDBM50152472
Substrate/Competitorn/a
Meas. Tech.ChEMBL_306737 (CHEMBL832324)
IC50 0.4±n/a nM
Citation Vasudevan, AWodka, DVerzal, MKSouers, AJGao, JBrodjian, SFry, DDayton, BMarsh, KCHernandez, LEOgiela, CACollins, CAKym, PR Synthesis and evaluation of 2-amino-8-alkoxy quinolines as MCHr1 antagonists. Part 2. Bioorg Med Chem Lett14:4879-82 (2004) 
 
Melanin-concentrating hormone receptor 1
Name:Melanin-concentrating hormone receptor 1
Type:G Protein-Coupled Receptor (GPCR)
Mol. Mass.:45976.27
Organism:Homo sapiens (Human)
Description:Membranes from CHO-K1 cells stably expressing human MCH1R were used in assays.
Residue:422
BDBM50152472
NameBDBM50152472
Synonyms:CHEMBL182261 | N-[3-(2-Amino-quinolin-8-yloxy)-propyl]-3-chloro-benzamide
TypeSmall organic molecule
Emp. Form.C19H18ClN3O2
Mol. Mass.355.818
SMILESNc1ccc2cccc(OCCCNC(=O)c3cccc(Cl)c3)c2n1