Reaction Details
TargetProstaglandin D2 receptor
LigandBDBM50152515
Substrate/Competitorn/a
Meas. Tech.ChEMBL_303622 (CHEMBL828877)
Ki 3.5±n/a nM
Citation Torisu, KKobayashi, KIwahashi, MNakai, YOnoda, TNagase, TSugimoto, IOkada, YMatsumoto, RNanbu, FOhuchida, SNakai, HToda, M Discovery of orally active prostaglandin D2 receptor antagonists. Bioorg Med Chem Lett14:4891-5 (2004) 
 
Prostaglandin D2 receptor
Name:Prostaglandin D2 receptor
Type:Enzyme
Mol. Mass.:40288.87
Organism:Homo sapiens (Human)
Description:Q13258
Residue:359
BDBM50152515
NameBDBM50152515
Synonyms:CHEMBL364841 | {2-Methyl-1-[4-(4-methyl-3,4-dihydro-2H-benzo[1,4]oxazin-2-ylmethoxy)-benzoyl]-1H-indol-4-yl}-acetic acid
TypeSmall organic molecule
Emp. Form.C28H26N2O5
Mol. Mass.470.5164
SMILESCN1C[C@@H](COc2ccc(cc2)C(=O)n2c(C)cc3c(CC(O)=O)cccc23)Oc2ccccc12