Reaction Details
TargetDual specificity protein kinase TTK
LigandBDBM50569969
Substrate/Competitorn/a
Meas. Tech.ChEMBL_2157241 (CHEMBL5041901)
Kd 0.700000±n/a nM
Citation Lu, JHuang, YHuang, JHe, RHuang, MLu, XXu, YZhou, FZhang, ZDing, K Discovery of the First Examples of Threonine Tyrosine Kinase PROTAC Degraders. J Med Chem65:2313-2328 (2022) 
 
Dual specificity protein kinase TTK
Name:Dual specificity protein kinase TTK
Type:Protein
Mol. Mass.:97086.79
Organism:Homo sapiens (Human)
Description:P33981
Residue:857
BDBM50569969
NameBDBM50569969
Synonyms:CHEMBL4857210
TypeSmall organic molecule
Emp. Form.C29H39N7O3
Mol. Mass.533.6651
SMILESCCC(=O)N[C@H]1CC[C@H](CC1)n1c2nc(Nc3ccc(cc3OC)N3CCN(C)CC3)ncc2c(C)cc1=O