Reaction Details
TargetFlap endonuclease 1
LigandBDBM50083940
Substrate/Competitorn/a
Meas. Tech.ChEMBL_304758 (CHEMBL829355)
IC50 6960±n/a nM
Citation Tumey, LNHuck, BGleason, EWang, JSilver, DBrunden, KBoozer, SRundlett, SSherf, BMurphy, SBailey, ADent, TLeventhal, CHarrington, JBennani, YL The identification and optimization of 2,4-diketobutyric acids as flap endonuclease 1 inhibitors. Bioorg Med Chem Lett14:4915-8 (2004) 
 
Flap endonuclease 1
Name:Flap endonuclease 1
Type:PROTEIN
Mol. Mass.:42602.57
Organism:Homo sapiens (Human)
Description:ChEMBL_1517026
Residue:380
BDBM50083940
NameBDBM50083940
Synonyms:4-(3-Chloro-phenyl)-2-hydroxy-4-oxo-but-2-enoic acid (0.2H2O) CHEMBL278763 | Sacchettini_6
TypeSmall organic molecule
Emp. Form.C10H7ClO4
Mol. Mass.226.613
SMILESOC(=O)C(=O)CC(=O)c1cccc(Cl)c1