Reaction Details
TargetFlap endonuclease 1
LigandBDBM50152563
Substrate/Competitorn/a
Meas. Tech.ChEMBL_304758 (CHEMBL829355)
IC50 1660±n/a nM
Citation Tumey, LNHuck, BGleason, EWang, JSilver, DBrunden, KBoozer, SRundlett, SSherf, BMurphy, SBailey, ADent, TLeventhal, CHarrington, JBennani, YL The identification and optimization of 2,4-diketobutyric acids as flap endonuclease 1 inhibitors. Bioorg Med Chem Lett14:4915-8 (2004) 
 
Flap endonuclease 1
Name:Flap endonuclease 1
Type:PROTEIN
Mol. Mass.:42602.57
Organism:Homo sapiens (Human)
Description:ChEMBL_1517026
Residue:380
BDBM50152563
NameBDBM50152563
Synonyms:2,4-Dioxo-4-(5-phenyl-furan-2-yl)-butyric acid | CHEMBL440938
TypeSmall organic molecule
Emp. Form.C14H10O5
Mol. Mass.258.2262
SMILESOC(=O)C(=O)CC(=O)c1ccc(o1)-c1ccccc1