Reaction Details
TargetFlap endonuclease 1
LigandBDBM50152565
Substrate/Competitorn/a
Meas. Tech.ChEMBL_304758 (CHEMBL829355)
IC50 190±n/a nM
Citation Tumey, LNHuck, BGleason, EWang, JSilver, DBrunden, KBoozer, SRundlett, SSherf, BMurphy, SBailey, ADent, TLeventhal, CHarrington, JBennani, YL The identification and optimization of 2,4-diketobutyric acids as flap endonuclease 1 inhibitors. Bioorg Med Chem Lett14:4915-8 (2004) 
 
Flap endonuclease 1
Name:Flap endonuclease 1
Type:PROTEIN
Mol. Mass.:42602.57
Organism:Homo sapiens (Human)
Description:ChEMBL_1517026
Residue:380
BDBM50152565
NameBDBM50152565
Synonyms:4-(4-Chloro-4''-methoxy-biphenyl-3-yl)-2,4-dioxo-butyric acid | CHEMBL182748
TypeSmall organic molecule
Emp. Form.C17H13ClO5
Mol. Mass.332.735
SMILESCOc1ccc(cc1)-c1ccc(Cl)c(c1)C(=O)CC(=O)C(O)=O