Reaction Details
TargetDNA excision repair protein ERCC-5
LigandBDBM50152572
Substrate/Competitorn/a
Meas. Tech.ChEMBL_304836 (CHEMBL827924)
IC50 1850±n/a nM
Citation Tumey, LNHuck, BGleason, EWang, JSilver, DBrunden, KBoozer, SRundlett, SSherf, BMurphy, SBailey, ADent, TLeventhal, CHarrington, JBennani, YL The identification and optimization of 2,4-diketobutyric acids as flap endonuclease 1 inhibitors. Bioorg Med Chem Lett14:4915-8 (2004) 
 
DNA excision repair protein ERCC-5
Name:DNA excision repair protein ERCC-5
Type:PROTEIN
Mol. Mass.:133069.11
Organism:Homo sapiens (Human)
Description:ChEMBL_305129
Residue:1186
BDBM50152572
NameBDBM50152572
Synonyms:2,4-Dioxo-4-(5-phenyl-thiophen-2-yl)-butyric acid | CHEMBL182485
TypeSmall organic molecule
Emp. Form.C14H10O4S
Mol. Mass.274.292
SMILESOC(=O)C(=O)CC(=O)c1ccc(s1)-c1ccccc1