Reaction Details
TargetDNA excision repair protein ERCC-5
LigandBDBM50152567
Substrate/Competitorn/a
Meas. Tech.ChEMBL_304836 (CHEMBL827924)
IC50 2320±n/a nM
Citation Tumey, LNHuck, BGleason, EWang, JSilver, DBrunden, KBoozer, SRundlett, SSherf, BMurphy, SBailey, ADent, TLeventhal, CHarrington, JBennani, YL The identification and optimization of 2,4-diketobutyric acids as flap endonuclease 1 inhibitors. Bioorg Med Chem Lett14:4915-8 (2004) 
 
DNA excision repair protein ERCC-5
Name:DNA excision repair protein ERCC-5
Type:PROTEIN
Mol. Mass.:133069.11
Organism:Homo sapiens (Human)
Description:ChEMBL_305129
Residue:1186
BDBM50152567
NameBDBM50152567
Synonyms:2,4-Dioxo-4-(5-trifluoromethyl-thiophen-2-yl)-butyric acid | CHEMBL367585
TypeSmall organic molecule
Emp. Form.C9H5F3O4S
Mol. Mass.266.194
SMILESOC(=O)C(=O)CC(=O)c1ccc(s1)C(F)(F)F