Reaction Details
TargetFatty acid-binding protein, intestinal
LigandBDBM50152852
Substrate/Competitorn/a
Meas. Tech.ChEMBL_305929 (CHEMBL833476)
IC50 3900±n/a nM
Citation Lehmann, FHaile, SAxen, EMedina, CUppenberg, JSvensson, SLundbäck, TRondahl, LBarf, T Discovery of inhibitors of human adipocyte fatty acid-binding protein, a potential type 2 diabetes target. Bioorg Med Chem Lett14:4445-8 (2004) 
 
Fatty acid-binding protein, intestinal
Name:Fatty acid-binding protein, intestinal
Type:Protein
Mol. Mass.:15207.56
Organism:Homo sapiens (Human)
Description:n/a
Residue:132
BDBM50152852
NameBDBM50152852
Synonyms:3-(5-Bromo-indole-1-sulfonyl)-thiophene-2-carboxylic acid | CHEMBL427320
TypeSmall organic molecule
Emp. Form.C13H8BrNO4S2
Mol. Mass.386.241
SMILESOC(=O)c1sccc1S(=O)(=O)n1ccc2cc(Br)ccc12