Reaction Details
TargetFatty acid-binding protein, adipocyte
LigandBDBM50152852
Substrate/Competitorn/a
Meas. Tech.ChEMBL_305906 (CHEMBL832621)
IC50 1300±n/a nM
Citation Lehmann, FHaile, SAxen, EMedina, CUppenberg, JSvensson, SLundbäck, TRondahl, LBarf, T Discovery of inhibitors of human adipocyte fatty acid-binding protein, a potential type 2 diabetes target. Bioorg Med Chem Lett14:4445-8 (2004) 
 
Fatty acid-binding protein, adipocyte
Name:Fatty acid-binding protein, adipocyte
Type:Enzyme
Mol. Mass.:14719.23
Organism:Homo sapiens (Human)
Description:P15090
Residue:132
BDBM50152852
NameBDBM50152852
Synonyms:3-(5-Bromo-indole-1-sulfonyl)-thiophene-2-carboxylic acid | CHEMBL427320
TypeSmall organic molecule
Emp. Form.C13H8BrNO4S2
Mol. Mass.386.241
SMILESOC(=O)c1sccc1S(=O)(=O)n1ccc2cc(Br)ccc12