Reaction Details
TargetFatty acid-binding protein 5
LigandBDBM50152852
Substrate/Competitorn/a
Meas. Tech.ChEMBL_305928 (CHEMBL833475)
IC50 14000±n/a nM
Citation Lehmann, FHaile, SAxen, EMedina, CUppenberg, JSvensson, SLundbäck, TRondahl, LBarf, T Discovery of inhibitors of human adipocyte fatty acid-binding protein, a potential type 2 diabetes target. Bioorg Med Chem Lett14:4445-8 (2004) 
 
Fatty acid-binding protein 5
Name:Fatty acid-binding protein 5
Type:Enzyme
Mol. Mass.:15164.79
Organism:Homo sapiens (Human)
Description:Q01469
Residue:135
BDBM50152852
NameBDBM50152852
Synonyms:3-(5-Bromo-indole-1-sulfonyl)-thiophene-2-carboxylic acid | CHEMBL427320
TypeSmall organic molecule
Emp. Form.C13H8BrNO4S2
Mol. Mass.386.241
SMILESOC(=O)c1sccc1S(=O)(=O)n1ccc2cc(Br)ccc12