Reaction Details
TargetProstaglandin G/H synthase 1
LigandBDBM50153034
Substrate/Competitorn/a
Meas. Tech.ChEMBL_304821 (CHEMBL827910)
IC50 6000±n/a nM
Citation Hsu, NCai, DDamodaran, KGomez, RFKeck, JGLaborde, ELum, RTMacke, TJMartin, GSchow, SRSimon, RJVillar, HOWick, MMBeroza, P Novel cyclooxygenase-1 inhibitors discovered using affinity fingerprints. J Med Chem47:4875-80 (2004) 
 
Prostaglandin G/H synthase 1
Name:Prostaglandin G/H synthase 1
Type:Protein
Mol. Mass.:68868.60
Organism:Ovis aries (Sheep)
Description:n/a
Residue:600
BDBM50153034
NameBDBM50153034
Synonyms:(3-Benzoyl-2,6-dihydroxy-phenyl)-phenyl-methanone | CHEMBL365014
TypeSmall organic molecule
Emp. Form.C20H14O4
Mol. Mass.318.3228
SMILESOc1ccc(C(=O)c2ccccc2)c(O)c1C(=O)c1ccccc1