Reaction Details
TargetProstaglandin G/H synthase 1
LigandBDBM50153035
Substrate/Competitorn/a
Meas. Tech.ChEMBL_304821 (CHEMBL827910)
IC50 29000±n/a nM
Citation Hsu, NCai, DDamodaran, KGomez, RFKeck, JGLaborde, ELum, RTMacke, TJMartin, GSchow, SRSimon, RJVillar, HOWick, MMBeroza, P Novel cyclooxygenase-1 inhibitors discovered using affinity fingerprints. J Med Chem47:4875-80 (2004) 
 
Prostaglandin G/H synthase 1
Name:Prostaglandin G/H synthase 1
Type:Protein
Mol. Mass.:68868.60
Organism:Ovis aries (Sheep)
Description:n/a
Residue:600
BDBM50153035
NameBDBM50153035
Synonyms:4-Methoxy-dibenzofuran-3-ol | CHEMBL365211
TypeSmall organic molecule
Emp. Form.C13H10O3
Mol. Mass.214.2167
SMILESCOc1c(O)ccc2c1oc1ccccc21