Reaction Details
TargetPeptide deformylase
LigandBDBM50153082
Substrate/Competitorn/a
Meas. Tech.ChEMBL_303553 (CHEMBL828953)
Ki 74±n/a nM
Citation Hu, XNguyen, KTJiang, VCLofland, DMoser, HEPei, D Macrocyclic inhibitors for peptide deformylase: a structure-activity relationship study of the ring size. J Med Chem47:4941-9 (2004) 
 
Peptide deformylase
Name:Peptide deformylase
Type:n/a
Mol. Mass.:16901.39
Organism:Escherichia coli
Description:n/a
Residue:150
BDBM50153082
NameBDBM50153082
Synonyms:(R)-2-[(Formyl-hydroxy-amino)-methyl]-heptanoic acid [5-amino-1-((S)-hexylcarbamoyl)-pentyl]-amide | CHEMBL365632
TypeSmall organic molecule
Emp. Form.C21H42N4O4
Mol. Mass.414.5826
SMILESCCCCCCNC(=O)[C@H](CCCCN)NC(=O)[C@H](CCCCC)CN(O)C=O