Reaction Details
TargetMelanin-concentrating hormone receptor 2
LigandBDBM50153204
Substrate/Competitorn/a
Meas. Tech.ChEMBL_306823 (CHEMBL831014)
IC50 2880±n/a nM
Citation Receveur, JMBjurling, EUlven, TLittle, PBNørregaard, PKHögberg, T 4-Acylamino-and 4-ureidobenzamides as melanin-concentrating hormone (MCH) receptor 1 antagonists. Bioorg Med Chem Lett14:5075-80 (2004) 
 
Melanin-concentrating hormone receptor 2
Name:Melanin-concentrating hormone receptor 2
Type:Enzyme Catalytic Domain
Mol. Mass.:38862.16
Organism:Homo sapiens (Human)
Description:Melanin Concentrating Hormone 2 GPR145 HUMAN::Q969V1
Residue:340
BDBM50153204
NameBDBM50153204
Synonyms:CHEMBL186894 | N-[2-(4-Benzyl-piperazin-1-yl)-ethyl]-4-[3-(4-phenoxy-phenyl)-ureido]-benzamide
TypeSmall organic molecule
Emp. Form.C33H35N5O3
Mol. Mass.549.6627
SMILESO=C(Nc1ccc(Oc2ccccc2)cc1)Nc1ccc(cc1)C(=O)NCCN1CCN(Cc2ccccc2)CC1