Reaction Details
TargetD(4) dopamine receptor
LigandBDBM50153255
Substrate/Competitorn/a
Meas. Tech.ChEMBL_310597 (CHEMBL834253)
EC50 26.8±n/a nM
Citation Matulenko, MASurber, BFan, LKolasa, TNakane, MTerranova, MAUchic, MEMiller, LNChang, RDonnelly-Roberts, DLNamovic, MTMoreland, RBBrioni, JDStewart, AO Synthesis and activity of 2-[4-(4-[3H]-2-cyanophenyl)piperazinyl]-N-(2,4,6-[3H]3-3-methylphenyl)acetamide: a selective dopamine D4 receptor agonist and radioligand. Bioorg Med Chem Lett14:5095-8 (2004) 
 
D(4) dopamine receptor
Name:D(4) dopamine receptor
Type:Enzyme
Mol. Mass.:48373.19
Organism:Homo sapiens (Human)
Description:P21917
Residue:419
BDBM50153255
NameBDBM50153255
Synonyms:2-[4-(2-Methoxy-phenyl)-piperazin-1-yl]-N-m-tolyl-acetamide | CHEMBL184486
TypeSmall organic molecule
Emp. Form.C20H25N3O2
Mol. Mass.339.4314
SMILESCOc1ccccc1N1CCN(CC(=O)Nc2cccc(C)c2)CC1