Reaction Details
TargetD(4) dopamine receptor
LigandBDBM50153266
Substrate/Competitorn/a
Meas. Tech.ChEMBL_302872 (CHEMBL828786)
Ki 90.7±n/a nM
Citation Matulenko, MASurber, BFan, LKolasa, TNakane, MTerranova, MAUchic, MEMiller, LNChang, RDonnelly-Roberts, DLNamovic, MTMoreland, RBBrioni, JDStewart, AO Synthesis and activity of 2-[4-(4-[3H]-2-cyanophenyl)piperazinyl]-N-(2,4,6-[3H]3-3-methylphenyl)acetamide: a selective dopamine D4 receptor agonist and radioligand. Bioorg Med Chem Lett14:5095-8 (2004) 
 
D(4) dopamine receptor
Name:D(4) dopamine receptor
Type:Enzyme
Mol. Mass.:48373.19
Organism:Homo sapiens (Human)
Description:P21917
Residue:419
BDBM50153266
NameBDBM50153266
Synonyms:2-[4-(4-Fluoro-phenyl)-piperazin-1-yl]-N-m-tolyl-acetamide | CHEMBL185263
TypeSmall organic molecule
Emp. Form.C19H22FN3O
Mol. Mass.327.3959
SMILESCc1cccc(NC(=O)CN2CCN(CC2)c2ccc(F)cc2)c1