Reaction Details
TargetAdenosine receptor A1
LigandBDBM50584555
Substrate/Competitorn/a
Meas. Tech.ChEMBL_2160162 (CHEMBL5044912)
Ki 1.5±n/a nM
Citation Val, CRodríguez-García, CPrieto-Díaz, RCrespo, AAzuaje, JCarbajales, CMajellaro, MDíaz-Holguín, ABrea, JMLoza, MIGioé-Gallo, CContino, MStefanachi, AGarcía-Mera, XEstévez, JCGutiérrez-de-Terán, HSotelo, E Optimization of 2-Amino-4,6-diarylpyrimidine-5-carbonitriles as Potent and Selective A J Med Chem65:2091-2106 (2022) 
 
Adenosine receptor A1
Name:Adenosine receptor A1
Type:G Protein-Coupled Receptor (GPCR)
Mol. Mass.:36520.92
Organism:Homo sapiens (Human)
Description:P30542
Residue:326
BDBM50584555
NameBDBM50584555
Synonyms:CHEMBL5084351
TypeSmall organic molecule
Emp. Form.C17H12N4O
Mol. Mass.288.3034
SMILESNc1nc(-c2ccccc2)c(C#N)c(n1)-c1cccc(O)c1