Reaction Details
TargetAdenosine receptor A1
LigandBDBM50375500
Substrate/Competitorn/a
Meas. Tech.ChEMBL_2160162 (CHEMBL5044912)
Ki 1.8±n/a nM
Citation Val, CRodríguez-García, CPrieto-Díaz, RCrespo, AAzuaje, JCarbajales, CMajellaro, MDíaz-Holguín, ABrea, JMLoza, MIGioé-Gallo, CContino, MStefanachi, AGarcía-Mera, XEstévez, JCGutiérrez-de-Terán, HSotelo, E Optimization of 2-Amino-4,6-diarylpyrimidine-5-carbonitriles as Potent and Selective A J Med Chem65:2091-2106 (2022) 
 
Adenosine receptor A1
Name:Adenosine receptor A1
Type:G Protein-Coupled Receptor (GPCR)
Mol. Mass.:36520.92
Organism:Homo sapiens (Human)
Description:P30542
Residue:326
BDBM50375500
NameBDBM50375500
Synonyms:CHEMBL259607
TypeSmall organic molecule
Emp. Form.C18H12N4O2
Mol. Mass.316.3135
SMILESNc1nc(-c2ccccc2)c(C#N)c(n1)-c1ccc2OCOc2c1