Reaction Details
TargetAdenosine receptor A2a
LigandBDBM50161342
Substrate/Competitorn/a
Meas. Tech.ChEMBL_2160163 (CHEMBL5044913)
Ki 1.1±n/a nM
Citation Val, CRodríguez-García, CPrieto-Díaz, RCrespo, AAzuaje, JCarbajales, CMajellaro, MDíaz-Holguín, ABrea, JMLoza, MIGioé-Gallo, CContino, MStefanachi, AGarcía-Mera, XEstévez, JCGutiérrez-de-Terán, HSotelo, E Optimization of 2-Amino-4,6-diarylpyrimidine-5-carbonitriles as Potent and Selective A J Med Chem65:2091-2106 (2022) 
 
Adenosine receptor A2a
Name:Adenosine receptor A2a
Type:G Protein-Coupled Receptor (GPCR)
Mol. Mass.:44716.46
Organism:Homo sapiens (Human)
Description:P29274
Residue:412
BDBM50161342
NameBDBM50161342
Synonyms:2-Amino-4-phenyl-indeno[1,2-d]pyrimidin-5-one CHEMBL369573
TypeSmall organic molecule
Emp. Form.C17H11N3O
Mol. Mass.273.2887
SMILESNc1nc2-c3ccccc3C(=O)c2c(n1)-c1ccccc1