Reaction Details
TargetAdenosine receptor A1
LigandBDBM50375499
Substrate/Competitorn/a
Meas. Tech.ChEMBL_2160164 (CHEMBL5044914)
Ki 1.2±n/a nM
Citation Val, CRodríguez-García, CPrieto-Díaz, RCrespo, AAzuaje, JCarbajales, CMajellaro, MDíaz-Holguín, ABrea, JMLoza, MIGioé-Gallo, CContino, MStefanachi, AGarcía-Mera, XEstévez, JCGutiérrez-de-Terán, HSotelo, E Optimization of 2-Amino-4,6-diarylpyrimidine-5-carbonitriles as Potent and Selective A J Med Chem65:2091-2106 (2022) 
 
Adenosine receptor A1
Name:Adenosine receptor A1
Type:G Protein-Coupled Receptor (GPCR)
Mol. Mass.:36520.92
Organism:Homo sapiens (Human)
Description:P30542
Residue:326
BDBM50375499
NameBDBM50375499
Synonyms:CHEMBL259319
TypeSmall organic molecule
Emp. Form.C24H20N4O3
Mol. Mass.412.4406
SMILESO=C(Nc1nc(-c2ccccc2)c(C#N)c(n1)-c1ccc2OCOc2c1)C1CCCC1