Reaction Details
TargetAdenosine receptor A2a
LigandBDBM50584560
Substrate/Competitorn/a
Meas. Tech.ChEMBL_2160170 (CHEMBL5044920)
Ki 0.950000±n/a nM
Citation Val, CRodríguez-García, CPrieto-Díaz, RCrespo, AAzuaje, JCarbajales, CMajellaro, MDíaz-Holguín, ABrea, JMLoza, MIGioé-Gallo, CContino, MStefanachi, AGarcía-Mera, XEstévez, JCGutiérrez-de-Terán, HSotelo, E Optimization of 2-Amino-4,6-diarylpyrimidine-5-carbonitriles as Potent and Selective A J Med Chem65:2091-2106 (2022) 
 
Adenosine receptor A2a
Name:Adenosine receptor A2a
Type:G Protein-Coupled Receptor (GPCR)
Mol. Mass.:44716.46
Organism:Homo sapiens (Human)
Description:P29274
Residue:412
BDBM50584560
NameBDBM50584560
Synonyms:CHEMBL5077370
TypeSmall organic molecule
Emp. Form.C20H18N4O3
Mol. Mass.362.3819
SMILESCOc1cc(cc(OC)c1OC)-c1nc(N)nc(-c2ccccc2)c1C#N